RP1,RECTYPE,RESTATUS,STATEOC,COUNTYOC,Region,DIVSTOC,EXSTATOC,STATERS,COUNTYRS,CITYRS,RP2,POPMSA,RP3,Ed89,Ed03,Edflag,monthdeath,RP4,Sex,ageunit,age,ageflag,age52,age27,age12,age22,placedeath,marital,doweek,RP5,year,workinjury,mannerdeath,disposition,autopsy,RP6,activitycode,placeinjury,ICD10,list358,RP7,list113,list130,list39,RP8,EANUM,entity1,entity2,entity3,entity4,entity5,entity6,entity7,entity8,entity9,entity10,entity11,entity12,entity13,entity14,entity15,entity16,entity17,entity18,entity19,entity20,RP9,RANUM,RP10,record1,record2,record3,record4,record5,record6,record7,record8,record9,record10,record11,record12,record13,record14,record15,record16,record17,record18,record19,record20,RP11,race,raceflag,raceimpflag,race3,race5,RP12,Hisp,RP13,Hisprace
 ,2,2,PR,999, , 9,PR, ,PR9,99, ,9,       PR,00, ,0,01, ,F,104,9, ,35,15,07, ,1,S,2, ,2007,U,7,U,N, , , ,J189,257, ,078, ,27, ,07,11I469,21J80,31A419,41J189,61E149,62I10,63F79, , , , , , , , , , , , , , ,07, ,J189,A419,E149,F79,I10,I469,J80, , , , , , , , , , , , , , ,01, , ,1,1, ,998, ,9
 ,1,1,PR,999, , 9,PR, ,PR9,99, ,9,       PR,08, ,0,01, ,F,108,3, ,42,22,10, ,4,W,2, ,2007,U,7,U,N, , , ,G309,189, ,052, ,17, ,03,11A419,21J189,31G309, , , , , , , , , , , , , , , , , , ,03, ,G309,A419,J189, , , , , , , , , , , , , , , , , , ,01, , ,1,1, ,998, ,9
 ,1,1,PR,999, , 9,PR, ,PR9,99, ,9,       PR,04, ,0,01, ,F,108,2, ,42,22,10, ,4,W,2, ,2007,U,7,U,N, , , ,I64,238, ,070, ,24, ,03,11R092,21I64,61D649, , , , , , , , , , , , , , , , , , ,03, ,I64,D649,R092, , , , , , , , , , , , , , , , , , ,01, , ,1,1, ,998, ,9
 ,1,1,PR,025, , 3,PR, ,PR0,25, ,3,       PR,12, ,0,01, ,M,109,0, ,44,24,11, ,4,M,2, ,2007,U,7,U,N, , , ,C189,081, ,023, ,06, ,07,11I469,21C189,31D649,41D469,51G309,61I48,62I500, , , , , , , , , , , , , , ,07, ,C189,D469,D649,G309,I469,I48,I500, , , , , , , , , , , , , , ,01, , ,1,1, ,998, ,9
 ,2,2,PR,999, , 9,PR, ,PR9,99, ,9,       PR,09, ,0,01, ,F,107,4, ,40,20,09, ,1,D,2, ,2007,U,7,U,N, , , ,C259,088, ,025, ,07, ,03,11C259,21A419,31E140, , , , , , , , , , , , , , , , , , ,03, ,C259,A419,E140, , , , , , , , , , , , , , , , , , ,01, , ,1,1, ,998, ,9
 ,1,1,PR,999, , 9,PR, ,PR9,99, ,9,       PR,03, ,0,01, ,M,107,2, ,40,20,09, ,4,M,2, ,2007,U,7,U,N, , , ,I219,211, ,059, ,21, ,04,11I469,21I219,31I10,41I500, , , , , , , , , , , , , , , , , ,04, ,I219,I10,I469,I500, , , , , , , , , , , , , , , , , ,01, , ,1,1, ,998, ,9
 ,1,1,PR,097, , 3,PR, ,PR0,97, ,3,       PR,03, ,0,01, ,M,106,3, ,38,18,08, ,1,D,2, ,2007,U,7,U,Y, , , ,K769,301, ,111, ,37, ,02,11K769,21J969, , , , , , , , , , , , , , , , , , , ,02, ,K769,J969, , , , , , , , , , , , , , , , , , , ,01, , ,1,1, ,998, ,9
 ,1,1,PR,999, , 9,PR, ,PR9,99, ,9,       PR,04, ,0,01, ,M,109,6, ,45,25,11, ,4,M,2, ,2007,U,7,U,N, , , ,C439,098, ,028, ,15, ,03,11C439,21J449,31I500, , , , , , , , , , , , , , , , , , ,03, ,C439,I500,J449, , , , , , , , , , , , , , , , , , ,01, , ,1,1, ,998, ,9
 ,1,1,PR,999, , 9,PR, ,PR9,99, ,9,       PR,01, ,0,01, ,F,108,5, ,43,23,11, ,4,W,3, ,2007,U,7,U,N, , , ,L984,309, ,111, ,37, ,03,11J960,21R54,31L984, , , , , , , , , , , , , , , , , , ,03, ,L984,J960,R54, , , , , , , , , , , , , , , , , , ,01, , ,1,1, ,998, ,9
 ,1,1,PR,097, , 3,PR, ,PR0,97, ,3,       CU,06, ,0,01, ,F,108,8, ,43,23,11, ,4,W,2, ,2007,U,7,U,N, , , ,I469,228, ,068, ,22, ,01,11I469, , , , , , , , , , , , , , , , , , , , ,01, ,I469, , , , , , , , , , , , , , , , , , , , ,01, , ,1,1, ,998, ,9
 ,1,1,PR,999, , 9,PR, ,PR9,99, ,9,       PR,12, ,0,01, ,M,108,5, ,43,23,11, ,4,M,2, ,2007,U,7,U,N, , , ,I251,215, ,063, ,21, ,03,11I469,21I251,31I10, , , , , , , , , , , , , , , , , , ,03, ,I251,I10,I469, , , , , , , , , , , , , , , , , , ,01, , ,1,1, ,998, ,9
 ,2,2,PR,113, , 3,PR, ,PR9,99, ,9,       PR,05, ,0,01, ,F,108,3, ,42,22,10, ,1,W,2, ,2007,U,7,U,N, , , ,A419,023, ,010, ,37, ,04,11I619,21I219,31B49,41A419, , , , , , , , , , , , , , , , , ,04, ,A419,B49,I219,I619, , , , , , , , , , , , , , , , , ,01, , ,1,1, ,998, ,9
 ,1,1,PR,999, , 9,PR, ,PR9,99, ,9,       PR,06, ,0,01, ,F,105,9, ,37,17,08, ,4,W,2, ,2007,U,7,U,N, , , ,I469,228, ,068, ,22, ,01,11I469, , , , , , , , , , , , , , , , , , , , ,01, ,I469, , , , , , , , , , , , , , , , , , , , ,02, , ,3,2, ,998, ,9
 ,1,1,PR,127, , 2,PR, ,PR1,27, ,2,       CU,16, ,0,01, ,M,107,1, ,40,20,09, ,1,M,2, ,2007,U,7,U,N, , , ,C182,081, ,023, ,06, ,02,11C182,21C780, , , , , , , , , , , , , , , , , , , ,02, ,C182,C780, , , , , , , , , , , , , , , , , , , ,01, , ,1,1, ,998, ,9
 ,1,1,PR,113, , 3,PR, ,PR1,13, ,3,       PR,01, ,0,01, ,F,109,0, ,44,24,11, ,1,W,3, ,2007,U,7,U,Y, , , ,J690,273, ,088, ,37, ,03,11A419,21N390,31J690, , , , , , , , , , , , , , , , , , ,03, ,J690,A419,N390, , , , , , , , , , , , , , , , , , ,01, , ,1,1, ,998, ,9
 ,1,1,PR,999, , 9,PR, ,PR9,99, ,9,       PR,00, ,0,01, ,F,109,8, ,45,25,11, ,4,W,2, ,2007,U,7,U,N, , , ,G309,189, ,052, ,17, ,04,11J180,21G309,31I10,41J449, , , , , , , , , , , , , , , , , ,04, ,G309,I10,J180,J449, , , , , , , , , , , , , , , , , ,01, , ,1,1, ,998, ,9
 ,1,1,PR,113, , 3,PR, ,PR1,13, ,3,       PR,12, ,0,01, ,F,108,5, ,43,23,11, ,1,W,3, ,2007,U,7,U,Y, , , ,I251,215, ,063, ,21, ,02,11J189,21I251, , , , , , , , , , , , , , , , , , , ,02, ,I251,J189, , , , , , , , , , , , , , , , , , , ,01, , ,1,1, ,998, ,9
 ,1,1,PR,999, , 9,PR, ,PR9,99, ,9,       PR,09, ,0,01, ,M,107,0, ,40,20,09, ,4,M,3, ,2007,U,7,U,N, , , ,C189,081, ,023, ,06, ,01,11C189, , , , , , , , , , , , , , , , , , , , ,01, ,C189, , , , , , , , , , , , , , , , , , , , ,01, , ,1,1, ,998, ,9
 ,1,1,PR,999, , 9,PR, ,PR9,99, ,9,       PR,14, ,0,01, ,F,107,2, ,40,20,09, ,4,S,3, ,2007,U,7,U,N, , , ,C259,088, ,025, ,07, ,03,11I469,21C259,31C780, , , , , , , , , , , , , , , , , , ,03, ,C259,C780,I469, , , , , , , , , , , , , , , , , , ,01, , ,1,1, ,998, ,9
 ,1,1,PR,113, , 3,PR, ,PR1,13, ,3,       PR,09, ,0,01, ,M,108,8, ,43,23,11, ,4,W,2, ,2007,U,7,U,N, , , ,I709,241, ,071, ,25, ,03,11I469,21I499,31I709, , , , , , , , , , , , , , , , , , ,03, ,I709,I469,I499, , , , , , , , , , , , , , , , , , ,01, , ,1,1, ,998, ,9
 ,1,1,PR,113, , 3,PR, ,PR1,13, ,3,       PR,03, ,0,01, ,M,107,1, ,40,20,09, ,1,D,3, ,2007,U,7,U,Y, , , ,I251,215, ,063, ,21, ,04,11I469,21I251,31J180,41I743, , , , , , , , , , , , , , , , , ,04, ,I251,I469,I743,J180, , , , , , , , , , , , , , , , , ,01, , ,1,1, ,998, ,9
 ,1,1,PR,113, , 3,PR, ,PR1,13, ,3,       PR,06, ,0,01, ,M,108,3, ,42,22,10, ,1,W,3, ,2007,U,7,U,N, , , ,J180,257, ,078, ,27, ,02,11J180,21R092, , , , , , , , , , , , , , , , , , , ,02, ,J180,R092, , , , , , , , , , , , , , , , , , , ,01, , ,1,1, ,998, ,9
 ,2,2,PR,113, , 3,PR, ,PR9,99, ,9,       PR,08, ,0,01, ,M,106,3, ,38,18,08, ,1,M,3, ,2007,U,7,U,N, , , ,I219,211, ,059, ,21, ,01,11I219, , , , , , , , , , , , , , , , , , , , ,01, ,I219, , , , , , , , , , , , , , , , , , , , ,01, , ,1,1, ,998, ,9
 ,1,1,PR,999, , 9,PR, ,PR9,99, ,9,       PR,06, ,0,01, ,M,106,5, ,39,19,09, ,4,S,2, ,2007,U,7,U,N, , , ,I219,211, ,059, ,21, ,02,11I219,21I251, , , , , , , , , , , , , , , , , , , ,02, ,I219,I251, , , , , , , , , , , , , , , , , , , ,01, , ,1,1, ,998, ,9
 ,1,1,PR,999, , 9,PR, ,PR9,99, ,9,       PR,03, ,0,01, ,M,108,6, ,43,23,11, ,4,W,3, ,2007,U,7,U,N, , , ,J439,266, ,084, ,28, ,03,11I469,21J449,31J439, , , , , , , , , , , , , , , , , , ,03, ,J439,I469,J449, , , , , , , , , , , , , , , , , , ,01, , ,1,1, ,998, ,9
 ,2,2,PR,127, , 2,PR, ,PR0,25, ,3,       PR,16, ,0,01, ,M,108,1, ,42,22,10, ,1,M,2, ,2007,U,7,U,Y, , , ,C220,085, ,024, ,15, ,03,11C220,21N179,31K767, , , , , , , , , , , , , , , , , , ,03, ,C220,K767,N179, , , , , , , , , , , , , , , , , , ,01, , ,1,1, ,998, ,9
 ,1,1,PR,999, , 9,PR, ,PR9,99, ,9,       PR,08, ,0,01, ,M,109,2, ,44,24,11, ,4,W,3, ,2007,U,7,U,N, , , ,I64,238, ,070, ,24, ,04,11I469,21I509,31I64,41I672, , , , , , , , , , , , , , , , , ,04, ,I64,I469,I509,I672, , , , , , , , , , , , , , , , , ,01, , ,1,1, ,998, ,9
 ,2,2,PR,999, , 9,PR, ,PR9,99, ,9,       PR,01, ,0,01, ,M,108,0, ,42,22,10, ,1,M,3, ,2007,U,7,U,N, , , ,I64,238, ,070, ,24, ,02,21J180,31I64, , , , , , , , , , , , , , , , , , , ,02, ,I64,J180, , , , , , , , , , , , , , , , , , , ,01, , ,1,1, ,998, ,9
 ,1,1,PR,999, , 9,PR, ,PR9,99, ,9,       PR,12, ,0,01, ,M,106,7, ,39,19,09, ,1,D,3, ,2007,U,7,U,N, , , ,K769,301, ,111, ,37, ,05,11I469,21R571,31K922,41I859,61K769, , , , , , , , , , , , , , , , ,04, ,K769,I469,I850,R571, , , , , , , , , , , , , , , , , ,01, , ,1,1, ,998, ,9
 ,1,1,PR,097, , 3,PR, ,PR0,97, ,3,       PR,06, ,0,01, ,F,107,1, ,40,20,09, ,1,W,2, ,2007,U,7,U,N, , , ,J690,273, ,088, ,37, ,03,11A419,21J690,31J969, , , , , , , , , , , , , , , , , , ,03, ,J690,A419,J969, , , , , , , , , , , , , , , , , , ,01, , ,1,1, ,998, ,9
 ,1,1,PR,999, , 9,PR, ,PR9,99, ,9,       PR,04, ,0,01, ,F,108,4, ,42,22,10, ,1,W,3, ,2007,U,7,U,N, , , ,J449,267, ,086, ,28, ,02,11J449,21J180, , , , , , , , , , , , , , , , , , , ,02, ,J449,J180, , , , , , , , , , , , , , , , , , , ,01, , ,1,1, ,998, ,9
 ,1,1,PR,999, , 9,PR, ,PR9,99, ,9,       PR,06, ,0,01, ,F,108,9, ,43,23,11, ,4,W,2, ,2007,U,7,U,N, , , ,G309,189, ,052, ,17, ,01,11G309, , , , , , , , , , , , , , , , , , , , ,01, ,G309, , , , , , , , , , , , , , , , , , , , ,01, , ,1,1, ,998, ,9
 ,1,1,PR,025, , 3,PR, ,PR0,25, ,3,       PR,12, ,0,01, ,M,108,3, ,42,22,10, ,1,W,3, ,2007,U,7,U,N, , , ,I120,208, ,069, ,23, ,04,11E889,21N19,31F019,41I10, , , , , , , , , , , , , , , , , ,05, ,I120,E889,F019,I10,N19, , , , , , , , , , , , , , , , ,01, , ,1,1, ,998, ,9
 ,2,2,PR,025, , 3,PR, ,PR9,99, ,9,       PR,02, ,0,01, ,M,108,4, ,42,22,10, ,1,W,2, ,2007,U,7,U,Y, , , ,A419,023, ,010, ,37, ,02,11I469,21A419, , , , , , , , , , , , , , , , , , , ,02, ,A419,I469, , , , , , , , , , , , , , , , , , , ,01, , ,1,1, ,998, ,9
 ,2,2,PR,025, , 3,PR, ,PR9,99, ,9,       PR,06, ,0,01, ,M,105,7, ,37,17,08, ,1,S,3, ,2007,U,7,U,N, , , ,B203,049, ,016, ,03, ,04,11K767,21B24,31K769,41B182, , , , , , , , , , , , , , , , , ,03, ,B203,B182,B238, , , , , , , , , , , , , , , , , , ,01, , ,1,1, ,998, ,9
 ,1,1,PR,999, , 9,PR, ,PR9,99, ,9,       PR,12, ,0,01, ,F,106,5, ,39,19,09, ,4,W,3, ,2007,U,7,U,N, , , ,C509,104, ,029, ,09, ,02,11I219,21C509, , , , , , , , , , , , , , , , , , , ,02, ,C509,I219, , , , , , , , , , , , , , , , , , , ,01, , ,1,1, ,998, ,9
 ,2,2,PR,999, , 9,PR, ,PR9,99, ,9,       PR,06, ,0,01, ,F,107,8, ,41,21,10, ,1,M,2, ,2007,U,7,U,N, , , ,J449,267, ,086, ,28, ,03,11I219,21J449,31J180, , , , , , , , , , , , , , , , , , ,03, ,J449,I219,J180, , , , , , , , , , , , , , , , , , ,01, , ,1,1, ,998, ,9
 ,1,1,PR,999, , 9,PR, ,PR9,99, ,9,       PR,04, ,0,01, ,F,108,9, ,43,23,11, ,1,W,3, ,2007,U,7,U,N, , , ,C189,081, ,023, ,06, ,01,11C189, , , , , , , , , , , , , , , , , , , , ,01, ,C189, , , , , , , , , , , , , , , , , , , , ,01, , ,1,1, ,998, ,9
 ,1,1,PR,999, , 9,PR, ,PR9,99, ,9,       PR,00, ,0,01, ,F,107,5, ,41,21,10, ,2,W,4, ,2007,U,7,U,N, , ,9,E149,159, ,046, ,16, ,07,11I469,21R090,22T178,23W80,31E149,32I10,41G309, , , , , , , , , , , , , , ,07, ,E149,G309,I10,I469,R090,T178,W80, , , , , , , , , , , , , , ,01, , ,1,1, ,998, ,9
 ,1,1,PR,999, , 9,PR, ,PR9,99, ,9,       PR,09, ,0,01, ,F,108,1, ,42,22,10, ,4,M,2, ,2007,U,7,U,N, , , ,I64,238, ,070, ,24, ,04,11I469,21I509,31I64,41I672, , , , , , , , , , , , , , , , , ,04, ,I64,I469,I509,I672, , , , , , , , , , , , , , , , , ,01, , ,1,1, ,998, ,9
 ,1,1,PR,025, , 3,PR, ,PR0,25, ,3,       PR,05, ,0,01, ,M,108,7, ,43,23,11, ,1,W,3, ,2007,U,7,U,N, , , ,K922,306, ,111, ,37, ,05,11J960,21A419,22B49,31J189,41K922, , , , , , , , , , , , , , , , ,05, ,K922,A419,B49,J189,J960, , , , , , , , , , , , , , , , ,01, , ,1,1, ,998, ,9
 ,1,1,PR,999, , 9,PR, ,PR9,99, ,9,       PR,17, ,0,01, ,F,107,5, ,41,21,10, ,4,S,3, ,2007,U,7,U,N, , , ,C229,085, ,024, ,15, ,04,11J969,21I509,31R104,41C229, , , , , , , , , , , , , , , , , ,04, ,C229,I509,J969,R104, , , , , , , , , , , , , , , , , ,01, , ,1,1, ,998, ,9
 ,1,1,PR,999, , 9,PR, ,PR9,99, ,9,       PR,00, ,0,01, ,F,108,3, ,42,22,10, ,1,W,3, ,2007,U,7,U,Y, , , ,I120,208, ,069, ,23, ,04,11I469,21K922,31I10,41N189, , , , , , , , , , , , , , , , , ,05, ,I120,I10,I469,K922,N189, , , , , , , , , , , , , , , , ,02, , ,3,2, ,998, ,9
 ,1,1,PR,999, , 9,PR, ,PR9,99, ,9,       PR,08, ,0,01, ,F,110,3, ,46,26,11, ,1,W,3, ,2007,U,7,U,Y, , , ,I10,206, ,069, ,23, ,04,11I469,21A419,31I10,41E86, , , , , , , , , , , , , , , , , ,04, ,I10,A419,E86,I469, , , , , , , , , , , , , , , , , ,02, , ,3,2, ,998, ,9
 ,1,1,PR,127, , 2,PR, ,PR1,27, ,2,       PR,08, ,0,01, ,M,108,8, ,43,23,11, ,2,M,2, ,2007,U,7,U,N, , , ,G20,188, ,051, ,37, ,04,11I469,21I219,31G20,41G309, , , , , , , , , , , , , , , , , ,04, ,G20,G309,I219,I469, , , , , , , , , , , , , , , , , ,01, , ,1,1, ,998, ,9
 ,1,1,PR,999, , 9,PR, ,PR9,99, ,9,       PR,08, ,0,01, ,M,107,6, ,41,21,10, ,4,M,2, ,2007,U,7,U,N, , , ,C64,117, ,034, ,12, ,03,11R688,21C64,31C780, , , , , , , , , , , , , , , , , , ,03, ,C64,C780,R688, , , , , , , , , , , , , , , , , , ,01, , ,1,1, ,998, ,9
 ,2,2,PR,127, , 2,PR, ,PR9,99, ,9,       PR,06, ,0,01, ,F,107,2, ,40,20,09, ,1,S,3, ,2007,U,7,U,N, , , ,C920,135, ,040, ,14, ,03,11I619,21C920,31D696, , , , , , , , , , , , , , , , , , ,03, ,C920,D696,I619, , , , , , , , , , , , , , , , , , ,02, , ,3,2, ,998, ,9
 ,2,2,PR,127, , 2,PR, ,PR9,99, ,9,       PR,12, ,0,01, ,M,106,8, ,39,19,09, ,1,M,2, ,2007,U,7,U,N, , , ,I629,236, ,070, ,24, ,03,11I269,12I249,21I629, , , , , , , , , , , , , , , , , , ,03, ,I629,I249,I269, , , , , , , , , , , , , , , , , , ,01, , ,1,1, ,998, ,9
 ,1,1,PR,999, , 9,PR, ,PR9,99, ,9,       PR,12, ,0,01, ,M,107,3, ,40,20,09, ,4,S,4, ,2007,U,7,U,N, , , ,I219,211, ,059, ,21, ,03,11I219,21I10,61I64, , , , , , , , , , , , , , , , , , ,03, ,I219,I10,I64, , , , , , , , , , , , , , , , , , ,01, , ,1,1, ,998, ,9
 ,2,2,PR,127, , 2,PR, ,PR9,99, ,9,       PR,00, ,0,01, ,F,200,1, ,12,02,01,12,1,S,3, ,2007,U,7,U,N, , , ,I272,219, ,068,047,22, ,03,11A419,31I272,41K529, , , , , , , , , , , , , , , , , , ,03, ,I272,A419,K529, , , , , , , , , , , , , , , , , , ,01, , ,1,1, ,998, ,9
 ,1,1,PR,127, , 2,PR, ,PR1,27, ,2,       PR,14, ,0,01, ,M,108,2, ,42,22,10, ,1,M,2, ,2007,U,7,U,N, , , ,I251,215, ,063, ,21, ,05,11I469,21L031,31I10,41J189,61I251, , , , , , , , , , , , , , , , ,05, ,I251,I10,I469,J189,L031, , , , , , , , , , , , , , , , ,01, , ,1,1, ,998, ,9
 ,2,2,PR,127, , 2,PR, ,PR0,31, ,3,       PR,04, ,0,01, ,F,107,1, ,40,20,09, ,1,D,2, ,2007,U,7,U,N, , , ,K769,301, ,111, ,37, ,03,11J969,21N180,31K769, , , , , , , , , , , , , , , , , , ,03, ,K769,J969,N180, , , , , , , , , , , , , , , , , , ,01, , ,1,1, ,998, ,9
 ,2,2,PR,127, , 2,PR, ,PR0,97, ,3,       PR,12, ,0,01, ,M,107,7, ,41,21,10, ,1,M,3, ,2007,U,7,U,Y, , , ,J189,257, ,078, ,27, ,03,11J80,21N179,31J189, , , , , , , , , , , , , , , , , , ,03, ,J189,J80,N179, , , , , , , , , , , , , , , , , , ,01, , ,1,1, ,998, ,9
 ,2,2,PR,127, , 2,PR, ,PR9,99, ,9,       PR,05, ,0,01, ,M,107,1, ,40,20,09, ,1,M,3, ,2007,U,7,U,N, , , ,J449,267, ,086, ,28, ,07,11I219,21N180,31K529,41J449,61E149,62D649,63I10, , , , , , , , , , , , , , ,06, ,J449,D649,E149,I120,I219,K529, , , , , , , , , , , , , , , ,01, , ,1,1, ,998, ,9
 ,1,1,PR,021, , 3,PR, ,PR0,21, ,3,       PR,03, ,0,01, ,F,107,7, ,41,21,10, ,1,M,2, ,2007,U,7,U,N, , , ,J961,278, ,089, ,37, ,02,11A419,21J961, , , , , , , , , , , , , , , , , , , ,02, ,J961,A419, , , , , , , , , , , , , , , , , , , ,01, , ,1,1, ,998, ,9
 ,1,1,PR,021, , 3,PR, ,PR0,21, ,3,       PR,08, ,0,01, ,F,107,6, ,41,21,10, ,4,M,2, ,2007,U,7,U,N, , , ,E149,159, ,046, ,16, ,04,11I251,12I10,31E149,41I469, , , , , , , , , , , , , , , , , ,04, ,E149,I10,I251,I469, , , , , , , , , , , , , , , , , ,01, , ,1,1, ,998, ,9
 ,1,1,PR,999, , 9,PR, ,PR9,99, ,9,       PR,06, ,0,01, ,M,108,2, ,42,22,10, ,1,M,4, ,2007,U,7,U,N, , , ,J449,267, ,086, ,28, ,03,11J690,21J939,31J449, , , , , , , , , , , , , , , , , , ,03, ,J449,J690,J939, , , , , , , , , , , , , , , , , , ,01, , ,1,1, ,998, ,9
 ,1,1,PR,999, , 9,PR, ,PR9,99, ,9,       PR,05, ,0,01, ,F,108,6, ,43,23,11, ,2,M,2, ,2007,U, ,U,N, , , ,E119,159, ,046, ,16, ,04,11I219,21I709,31I10,41E119, , , , , , , , , , , , , , , , , ,04, ,E119,I10,I219,I709, , , , , , , , , , , , , , , , , ,01, , ,1,1, ,998, ,9
 ,1,1,PR,021, , 3,PR, ,PR0,21, ,3,       PR,03, ,0,01, ,F,109,2, ,44,24,11, ,4,W,2, ,2007,U,7,U,N, , , ,I694,239, ,070, ,24, ,07,11I694,21I10,31R13,41G309,61E119,62N390,63M819, , , , , , , , , , , , , , ,07, ,I694,E119,G309,I10,M819,N390,R13, , , , , , , , , , , , , , ,01, , ,1,1, ,998, ,9
 ,2,2,PR,021, , 3,PR, ,PR9,99, ,9,       PR,03, ,0,01, ,F,107,8, ,41,21,10, ,1,W,3, ,2007,U,7,U,N, , , ,I219,211, ,059, ,21, ,04,11R570,21I219,31I10,41I500, , , , , , , , , , , , , , , , , ,04, ,I219,I10,I500,R570, , , , , , , , , , , , , , , , , ,01, , ,1,1, ,998, ,9
 ,1,1,PR,999, , 9,PR, ,PR9,99, ,9,       PR,03, ,0,01, ,M,106,1, ,38,18,08, ,4,D,4, ,2007,U,7,U,N, , , ,I219,211, ,059, ,21, ,02,41I219,61E149, , , , , , , , , , , , , , , , , , , ,02, ,I219,E149, , , , , , , , , , , , , , , , , , , ,01, , ,1,1, ,998, ,9
 ,1,1,PR,999, , 9,PR, ,PR9,99, ,9,       PR,06, ,0,01, ,F,107,4, ,40,20,09, ,4,M,2, ,2007,U,7,U,N, , , ,I110,207, ,056, ,20, ,03,11I469,21I500,31I10, , , , , , , , , , , , , , , , , , ,04, ,I110,I10,I469,I500, , , , , , , , , , , , , , , , , ,02, , ,3,2, ,998, ,9
 ,2,2,PR,113, , 3,PR, ,PR9,99, ,9,       PR,03, ,0,01, ,F,109,3, ,44,24,11, ,1,W,3, ,2007,U,7,U,N, ,9,9,W80,410, ,123, ,39, ,04,11J189,12T179,13W80,61I500, , , , , , , , , , , , , , , , , ,04, ,W80,I500,J189,T179, , , , , , , , , , , , , , , , , ,01, , ,1,1, ,998, ,9
 ,1,1,PR,999, , 9,PR, ,PR9,99, ,9,       PR,17, ,0,01, ,F,107,7, ,41,21,10, ,4,W,4, ,2007,U,7,U,Y, , , ,C349,093, ,027, ,08, ,02,11I469,21C349, , , , , , , , , , , , , , , , , , , ,02, ,C349,I469, , , , , , , , , , , , , , , , , , , ,01, , ,1,1, ,998, ,9
 ,1,1,PR,113, , 3,PR, ,PR1,13, ,3,       PR,06, ,0,01, ,F,108,5, ,43,23,11, ,6,W,4, ,2007,U,7,U,Y, , , ,G309,189, ,052, ,17, ,04,11I469,21R092,31G309,41E149, , , , , , , , , , , , , , , , , ,04, ,G309,E149,I469,R092, , , , , , , , , , , , , , , , , ,01, , ,1,1, ,998, ,9
 ,1,1,PR,113, , 3,PR, ,PR1,13, ,3,       YY,12, ,0,01, ,M,106,5, ,39,19,09, ,1,M,4, ,2007,U,7,U,Y, , , ,F102,178, ,111, ,37, ,03,11I219,21F102,41J690, , , , , , , , , , , , , , , , , , ,03, ,F102,I219,J690, , , , , , , , , , , , , , , , , , ,01, , ,1,1, ,998, ,9
 ,1,1,PR,999, , 9,PR, ,PR9,99, ,9,       PR,06, ,0,01, ,M,106,7, ,39,19,09, ,1,M,4, ,2007,U,7,U,N, , , ,J439,266, ,084, ,28, ,04,11A415,21R688,31J189,41J439, , , , , , , , , , , , , , , , , ,04, ,J439,A415,J189,R688, , , , , , , , , , , , , , , , , ,01, , ,1,1, ,998, ,9
 ,1,1,PR,999, , 9,PR, ,PR9,99, ,9,       PR,09, ,0,01, ,M,108,0, ,42,22,10, ,4,M,5, ,2007,U,7,U,Y, , , ,G309,189, ,052, ,17, ,02,11I519,21G309, , , , , , , , , , , , , , , , , , , ,02, ,G309,I519, , , , , , , , , , , , , , , , , , , ,01, , ,1,1, ,998, ,9
 ,1,1,PR,999, , 9,PR, ,PR9,99, ,9,       PR,00, ,0,01, ,F,108,4, ,42,22,10, ,4,M,2, ,2007,U,7,U,N, , , ,G309,189, ,052, ,17, ,03,11J969,21J189,31G309, , , , , , , , , , , , , , , , , , ,03, ,G309,J189,J969, , , , , , , , , , , , , , , , , , ,01, , ,1,1, ,998, ,9
 ,1,1,PR,999, , 9,PR, ,PR9,99, ,9,       PR,06, ,0,01, ,F,107,5, ,41,21,10, ,4,W,2, ,2007,U,7,U,N, , , ,I64,238, ,070, ,24, ,04,11J969,21A419,31L89,41I64, , , , , , , , , , , , , , , , , ,04, ,I64,A419,J969,L89, , , , , , , , , , , , , , , , , ,01, , ,1,1, ,998, ,9
 ,1,1,PR,999, , 9,PR, ,PR9,99, ,9,       PR,16, ,0,01, ,F,104,4, ,34,14,06, ,4,M,4, ,2007,U,7,U,N, , , ,C260,089, ,043, ,15, ,01,21C260, , , , , , , , , , , , , , , , , , , , ,01, ,C260, , , , , , , , , , , , , , , , , , , , ,01, , ,1,1, ,998, ,9
 ,1,1,PR,999, , 9,PR, ,PR9,99, ,9,       PR,00, ,0,01, ,M,107,3, ,40,20,09, ,4,M,5, ,2007,U,7,U,N, , , ,C189,081, ,023, ,06, ,04,11G931,21C189,31C787,41A419, , , , , , , , , , , , , , , , , ,04, ,C189,A419,C787,G931, , , , , , , , , , , , , , , , , ,01, , ,1,1, ,998, ,9
 ,1,1,PR,999, , 9,PR, ,PR9,99, ,9,       US,08, ,0,01, ,M,106,0, ,38,18,08, ,4,M,4, ,2007,U,7,U,N, , , ,C220,085, ,024, ,15, ,02,11C220,21K759, , , , , , , , , , , , , , , , , , , ,02, ,C220,K759, , , , , , , , , , , , , , , , , , , ,01, , ,1,1, ,998, ,9
 ,1,1,PR,999, , 9,PR, ,PR9,99, ,9,       PR,12, ,0,01, ,M,106,0, ,38,18,08, ,4,M,4, ,2007,U,7,U,N, , , ,I110,207, ,056, ,20, ,03,11I469,21I509,31I10, , , , , , , , , , , , , , , , , , ,04, ,I110,I10,I469,I509, , , , , , , , , , , , , , , , , ,01, , ,1,1, ,998, ,9
 ,2,2,PR,097, , 3,PR, ,PR9,99, ,9,       PR,05, ,0,01, ,M,109,5, ,45,25,11, ,1,W,4, ,2007,U,7,U,N, , , ,E145,159, ,046, ,16, ,06,11J969,21J189,31R02,41I739,61E149,62R02, , , , , , , , , , , , , , , ,05, ,E145,I739,J189,J969,R02, , , , , , , , , , , , , , , , ,01, , ,1,1, ,998, ,9
 ,1,1,PR,999, , 9,PR, ,PR9,99, ,9,       PR,03, ,0,01, ,F,108,7, ,43,23,11, ,4,W,2, ,2007,U,7,U,N, , , ,I64,238, ,070, ,24, ,02,11A419,31I64, , , , , , , , , , , , , , , , , , , ,02, ,I64,A419, , , , , , , , , , , , , , , , , , , ,01, , ,1,1, ,998, ,9
 ,1,1,PR,999, , 9,PR, ,PR9,99, ,9,       PR,14, ,0,01, ,M,109,3, ,44,24,11, ,4,M,4, ,2007,U,7,U,N, , , ,I64,238, ,070, ,24, ,04,11I469,21I509,31I64,41I672, , , , , , , , , , , , , , , , , ,04, ,I64,I469,I509,I672, , , , , , , , , , , , , , , , , ,01, , ,1,1, ,998, ,9
 ,2,2,PR,999, , 9,PR, ,PR9,99, ,9,       PR,01, ,0,01, ,M,108,4, ,42,22,10, ,1,M,3, ,2007,U,7,U,N, , , ,N19,327, ,100, ,31, ,03,11I500,21N19,31J969, , , , , , , , , , , , , , , , , , ,03, ,N19,I500,J969, , , , , , , , , , , , , , , , , , ,01, , ,1,1, ,998, ,9
 ,1,1,PR,999, , 9,PR, ,PR9,99, ,9,       PR,04, ,0,01, ,F,106,6, ,39,19,09, ,1,M,4, ,2007,U,7,U,N, , , ,E149,159, ,046, ,16, ,03,11K769,21J969,31E149, , , , , , , , , , , , , , , , , , ,03, ,E149,J969,K769, , , , , , , , , , , , , , , , , , ,01, , ,1,1, ,998, ,9
 ,2,2,PR,999, , 9,PR, ,PR9,99, ,9,       PR,07, ,0,01, ,M,107,0, ,40,20,09, ,1,M,4, ,2007,U,7,U,N, , , ,D649,152, ,045, ,37, ,03,11I509,31N19,41D649, , , , , , , , , , , , , , , , , , ,03, ,D649,I509,N19, , , , , , , , , , , , , , , , , , ,01, , ,1,1, ,998, ,9
 ,2,2,PR,999, , 9,PR, ,PR9,99, ,9,       PR,01, ,0,01, ,M,109,1, ,44,24,11, ,1,W,4, ,2007,U,7,U,N, , , ,K769,301, ,111, ,37, ,04,11I469,21I219,31J189,41K769, , , , , , , , , , , , , , , , , ,04, ,K769,I219,I469,J189, , , , , , , , , , , , , , , , , ,02, , ,3,2, ,998, ,9
 ,2,2,PR,127, , 2,PR, ,PR9,99, ,9,       PR,07, ,0,01, ,M,106,5, ,39,19,09, ,2,W,4, ,2007,U,7,U,N, , , ,K729,301, ,111, ,37, ,04,11K729,21N179,31K922,41K769, , , , , , , , , , , , , , , , , ,03, ,K729,K922,N179, , , , , , , , , , , , , , , , , , ,01, , ,1,1, ,998, ,9
 ,1,1,PR,999, , 9,PR, ,PR9,99, ,9,       PR,00, ,0,01, ,M,109,3, ,44,24,11, ,4,M,4, ,2007,U,7,U,N, , , ,D649,152, ,045, ,37, ,02,11I509,21D649, , , , , , , , , , , , , , , , , , , ,02, ,D649,I509, , , , , , , , , , , , , , , , , , , ,01, , ,1,1, ,998, ,9
 ,1,1,PR,999, , 9,PR, ,PR9,99, ,9,       PR,12, ,0,01, ,M,106,3, ,38,18,08, ,1,M,5, ,2007,U,7,U,Y, , , ,I219,211, ,059, ,21, ,02,11I219,21I10, , , , , , , , , , , , , , , , , , , ,02, ,I219,I10, , , , , , , , , , , , , , , , , , , ,02, , ,3,2, ,998, ,9
 ,1,1,PR,113, , 3,PR, ,PR1,13, ,3,       PR,08, ,0,01, ,F,108,8, ,43,23,11, ,1,W,2, ,2007,U,7,U,N, , , ,I219,211, ,059, ,21, ,05,11A419,21I219,61E149,62I429,63C189, , , , , , , , , , , , , , , , ,05, ,I219,A419,C189,E149,I429, , , , , , , , , , , , , , , , ,01, , ,1,1, ,998, ,9
 ,1,1,PR,113, , 3,PR, ,PR1,13, ,3,       PR,11, ,0,01, ,F,107,6, ,41,21,10, ,1,D,5, ,2007,U,7,U,Y, , , ,C719,122, ,036, ,15, ,03,11R092,31C719,41I500, , , , , , , , , , , , , , , , , , ,03, ,C719,I500,R092, , , , , , , , , , , , , , , , , , ,01, , ,1,1, ,998, ,9
 ,2,2,PR,113, , 3,PR, ,PR9,99, ,9,       PR,14, ,0,01, ,F,103,4, ,32,12,05, ,1,S,5, ,2007,U,7,U,Y, , , ,C189,081, ,023, ,06, ,02,11C189,21I10, , , , , , , , , , , , , , , , , , , ,02, ,C189,I10, , , , , , , , , , , , , , , , , , , ,01, , ,1,1, ,998, ,9